Reaction Details
TargetM-phase inducer phosphatase 3
LigandBDBM50388723
Substrate/Competitorn/a
Meas. Tech.ChEMBL_829766 (CHEMBL2061285)
IC50>100000±n/a nM
Citation Mak, LHKnott, JScott, KAScott, CWhyte, GFYe, YMann, DJCes, OStivers, JWoscholski, R Arylstibonic acids are potent and isoform-selective inhibitors of Cdc25a and Cdc25b phosphatases. Bioorg Med Chem20:4371-6 (2012) 
 
M-phase inducer phosphatase 3
Name:M-phase inducer phosphatase 3
Type:Substrate
Mol. Mass.:53366.11
Organism:Homo sapiens (Human)
Description:P30307
Residue:473
BDBM50388723
NameBDBM50388723
Synonyms:CHEMBL2057662
TypeSmall organic molecule
Emp. Form.C9H11O5Sb
Mol. Mass.320.94
SMILESOC(=O)CCc1cccc(c1)[Sb](O)(O)=O