Reaction Details
TargetReceptor-type tyrosine-protein phosphatase beta
LigandBDBM50388723
Substrate/Competitorn/a
Meas. Tech.ChEMBL_829768 (CHEMBL2061287)
IC50 1620±n/a nM
Citation Mak, LHKnott, JScott, KAScott, CWhyte, GFYe, YMann, DJCes, OStivers, JWoscholski, R Arylstibonic acids are potent and isoform-selective inhibitors of Cdc25a and Cdc25b phosphatases. Bioorg Med Chem20:4371-6 (2012) 
 
Receptor-type tyrosine-protein phosphatase beta
Name:Receptor-type tyrosine-protein phosphatase beta
Type:Protein
Mol. Mass.:224324.80
Organism:Homo sapiens (Human)
Description:P23467
Residue:1997
BDBM50388723
NameBDBM50388723
Synonyms:CHEMBL2057662
TypeSmall organic molecule
Emp. Form.C9H11O5Sb
Mol. Mass.320.94
SMILESOC(=O)CCc1cccc(c1)[Sb](O)(O)=O