Reaction Details
TargetDual specificity protein phosphatase 6
LigandBDBM50388723
Substrate/Competitorn/a
Meas. Tech.ChEMBL_829769 (CHEMBL2061288)
IC50>100000±n/a nM
Citation Mak, LHKnott, JScott, KAScott, CWhyte, GFYe, YMann, DJCes, OStivers, JWoscholski, R Arylstibonic acids are potent and isoform-selective inhibitors of Cdc25a and Cdc25b phosphatases. Bioorg Med Chem20:4371-6 (2012) 
 
Dual specificity protein phosphatase 6
Name:Dual specificity protein phosphatase 6
Type:PROTEIN
Mol. Mass.:42305.16
Organism:Homo sapiens (Human)
Description:ChEMBL_1476409
Residue:381
BDBM50388723
NameBDBM50388723
Synonyms:CHEMBL2057662
TypeSmall organic molecule
Emp. Form.C9H11O5Sb
Mol. Mass.320.94
SMILESOC(=O)CCc1cccc(c1)[Sb](O)(O)=O