Reaction Details
TargetM-phase inducer phosphatase 1
LigandBDBM50388723
Substrate/Competitorn/a
Meas. Tech.ChEMBL_829764 (CHEMBL2061244)
IC50 3150±n/a nM
Citation Mak, LHKnott, JScott, KAScott, CWhyte, GFYe, YMann, DJCes, OStivers, JWoscholski, R Arylstibonic acids are potent and isoform-selective inhibitors of Cdc25a and Cdc25b phosphatases. Bioorg Med Chem20:4371-6 (2012) 
 
M-phase inducer phosphatase 1
Name:M-phase inducer phosphatase 1
Type:Protein
Mol. Mass.:59090.18
Organism:Homo sapiens (Human)
Description:P30304
Residue:524
BDBM50388723
NameBDBM50388723
Synonyms:CHEMBL2057662
TypeSmall organic molecule
Emp. Form.C9H11O5Sb
Mol. Mass.320.94
SMILESOC(=O)CCc1cccc(c1)[Sb](O)(O)=O