Reaction Details
TargetM-phase inducer phosphatase 1
LigandBDBM26613
Substrate/Competitorn/a
Meas. Tech.ChEMBL_829778 (CHEMBL2061297)
Ki 72±n/a nM
Citation Mak, LHKnott, JScott, KAScott, CWhyte, GFYe, YMann, DJCes, OStivers, JWoscholski, R Arylstibonic acids are potent and isoform-selective inhibitors of Cdc25a and Cdc25b phosphatases. Bioorg Med Chem20:4371-6 (2012) 
 
M-phase inducer phosphatase 1
Name:M-phase inducer phosphatase 1
Type:Protein
Mol. Mass.:59090.18
Organism:Homo sapiens (Human)
Description:P30304
Residue:524
BDBM26613
NameBDBM26613
Synonyms:(2E)-3-{3-[dihydroxy(oxo)--stibanyl]phenyl}prop-2-enoic acid | Compound 13778
TypeSmall organic molecule
Emp. Form.C9H9O5Sb
Mol. Mass.318.92
SMILESOC(=O)\C=C\c1cccc(c1)[Sb](O)(O)=O