Reaction Details
TargetPhosphatidylglycerophosphatase and protein-tyrosine phosphatase 1
LigandBDBM50388723
Substrate/Competitorn/a
Meas. Tech.ChEMBL_829772 (CHEMBL2061291)
IC50 13440±n/a nM
Citation Mak, LHKnott, JScott, KAScott, CWhyte, GFYe, YMann, DJCes, OStivers, JWoscholski, R Arylstibonic acids are potent and isoform-selective inhibitors of Cdc25a and Cdc25b phosphatases. Bioorg Med Chem20:4371-6 (2012) 
 
Phosphatidylglycerophosphatase and protein-tyrosine phosphatase 1
Name:Phosphatidylglycerophosphatase and protein-tyrosine phosphatase 1
Type:PROTEIN
Mol. Mass.:22857.40
Organism:Homo sapiens (Human)
Description:ChEMBL_829772
Residue:201
BDBM50388723
NameBDBM50388723
Synonyms:CHEMBL2057662
TypeSmall organic molecule
Emp. Form.C9H11O5Sb
Mol. Mass.320.94
SMILESOC(=O)CCc1cccc(c1)[Sb](O)(O)=O