Reaction Details
TargetMacrophage colony-stimulating factor 1 receptor
LigandBDBM50388873
Substrate/Competitorn/a
Meas. Tech.ChEMBL_830843 (CHEMBL2065349)
Ki 5±n/a nM
Citation Milletti, FHermann, JC Targeted kinase selectivity from kinase profiling data. ACS Med Chem Lett3:383-386 (2012) 
 
Macrophage colony-stimulating factor 1 receptor
Name:Macrophage colony-stimulating factor 1 receptor
Type:Protein
Mol. Mass.:107979.48
Organism:Homo sapiens (Human)
Description:P07333
Residue:972
BDBM50388873
NameBDBM50388873
Synonyms:CHEMBL1964441
TypeSmall organic molecule
Emp. Form.C25H23N5OS
Mol. Mass.441.548
SMILESCNCC#Cc1cnc(N)c2c(csc12)-c1ccc(NC(=O)Nc2cccc(C)c2)cc1