Reaction Details
TargetPlatelet-derived growth factor receptor alpha
LigandBDBM50381703
Substrate/Competitorn/a
Meas. Tech.ChEMBL_830844 (CHEMBL2065350)
Ki 50±n/a nM
Citation Milletti, FHermann, JC Targeted kinase selectivity from kinase profiling data. ACS Med Chem Lett3:383-386 (2012) 
 
Platelet-derived growth factor receptor alpha
Name:Platelet-derived growth factor receptor alpha
Type:Protein
Mol. Mass.:122633.38
Organism:Homo sapiens (Human)
Description:P16234
Residue:1089
BDBM50381703
NameBDBM50381703
Synonyms:CHEMBL1970317
TypeSmall organic molecule
Emp. Form.C24H19FN6OS
Mol. Mass.458.511
SMILESCn1cc(cn1)-c1cnc(N)c2c(csc12)-c1ccc(NC(=O)Nc2cccc(F)c2)cc1