Reaction Details
TargetCell division cycle 7-related protein kinase
LigandBDBM50388876
Substrate/Competitorn/a
Meas. Tech.ChEMBL_830839 (CHEMBL2065345)
Ki 0.794328±n/a nM
Citation Milletti, FHermann, JC Targeted kinase selectivity from kinase profiling data. ACS Med Chem Lett3:383-386 (2012) 
 
Cell division cycle 7-related protein kinase
Name:Cell division cycle 7-related protein kinase
Type:Protein
Mol. Mass.:63908.16
Organism:Homo sapiens (Human)
Description:O00311
Residue:574
BDBM50388876
NameBDBM50388876
Synonyms:CHEMBL1983595
TypeSmall organic molecule
Emp. Form.C23H17ClN6O
Mol. Mass.428.874
SMILESClc1cccc(c1)C(=O)Nc1n[nH]c2ccc(cc12)-c1cn(Cc2ccccc2)nn1