Reaction Details
TargetMetabotropic glutamate receptor 1
LigandBDBM50388959
Substrate/Competitorn/a
Meas. Tech.ChEMBL_833080 (CHEMBL2067284)
IC50>10000±n/a nM
Citation Fujinaga, MYamasaki, TYui, JHatori, AXie, LKawamura, KAsagawa, CKumata, KYoshida, YOgawa, MNengaki, NFukumura, TZhang, MR Synthesis and evaluation of novel radioligands for positron emission tomography imaging of metabotropic glutamate receptor subtype 1 (mGluR1) in rodent brain. J Med Chem55:2342-52 (2012) 
 
Metabotropic glutamate receptor 1
Name:Metabotropic glutamate receptor 1
Type:Enzyme Catalytic Domain
Mol. Mass.:133240.47
Organism:RAT
Description:metabotropic glutamate 1/2 0 RAT::P23385
Residue:1199
BDBM50388959
NameBDBM50388959
Synonyms:CHEMBL2063724
TypeSmall organic molecule
Emp. Form.C21H24FN5O2S
Mol. Mass.429.511
SMILESCC(C)Nc1cc(ncn1)-c1csc(n1)N(C)C(=O)c1ccc(OCCCF)cc1