Reaction Details
TargetMetabotropic glutamate receptor 5
LigandBDBM50388958
Substrate/Competitorn/a
Meas. Tech.ChEMBL_833081 (CHEMBL2067285)
IC50>10000±n/a nM
Citation Fujinaga, MYamasaki, TYui, JHatori, AXie, LKawamura, KAsagawa, CKumata, KYoshida, YOgawa, MNengaki, NFukumura, TZhang, MR Synthesis and evaluation of novel radioligands for positron emission tomography imaging of metabotropic glutamate receptor subtype 1 (mGluR1) in rodent brain. J Med Chem55:2342-52 (2012) 
 
Metabotropic glutamate receptor 5
Name:Metabotropic glutamate receptor 5
Type:Enzyme
Mol. Mass.:131900.14
Organism:Rattus norvegicus (Rat)
Description:P31424
Residue:1203
BDBM50388958
NameBDBM50388958
Synonyms:CHEMBL2063723
TypeSmall organic molecule
Emp. Form.C20H22FN5O2S
Mol. Mass.415.484
SMILESCC(C)Nc1cc(ncn1)-c1csc(n1)N(C)C(=O)c1ccc(OCCF)cc1