Reaction Details
TargetSigma non-opioid intracellular receptor 1
LigandBDBM50321807
Substrate/Competitorn/a
Meas. Tech.ChEMBL_833107 (CHEMBL2067311)
Ki 350±n/a nM
Citation Oberdorf, CSchepmann, DVela, JMBuschmann, HHolenz, JWünsch, B Thiophene bioisosteres of spirocyclics receptor ligands: relationships between substitution pattern ands receptor affinity. J Med Chem55:5350-60 (2012) 
 
Sigma non-opioid intracellular receptor 1
Name:Sigma non-opioid intracellular receptor 1
Type:Protein
Mol. Mass.:25307.17
Organism:Cavia porcellus (Guinea pig)
Description:Q60492
Residue:223
BDBM50321807
NameBDBM50321807
Synonyms:(R)-1-benzyl-6',7'-dihydrospiro[piperidine-4,4'-thieno[3,2-c]pyran]-6'-carboxamide | CHEMBL1169739
TypeSmall organic molecule
Emp. Form.C19H22N2O2S
Mol. Mass.342.455
SMILESNC(=O)[C@H]1Cc2sccc2C2(CCN(Cc3ccccc3)CC2)O1