Reaction Details
TargetNeutrophil collagenase
LigandBDBM13126
Substrate/Competitorn/a
Meas. Tech.ChEMBL_832926 (CHEMBL2066797)
Ki 23±n/a nM
Citation Hugenberg, VBreyholz, HJRiemann, BHermann, SSchober, OSchäfers, MGangadharmath, UMocharla, VKolb, HWalsh, JZhang, WKopka, KWagner, S A new class of highly potent matrix metalloproteinase inhibitors based on triazole-substituted hydroxamates: (radio)synthesis and in vitro and first in vivo evaluation. J Med Chem55:4714-27 (2012) 
 
Neutrophil collagenase
Name:Neutrophil collagenase
Type:Enzyme
Mol. Mass.:53413.48
Organism:Homo sapiens (Human)
Description:P22894
Residue:467
BDBM13126
NameBDBM13126
Synonyms:(2R)-2-[benzyl(4-methoxybenzene)sulfonamido]-N-hydroxy-3-methylbutanamide CHEMBL85030
TypeSmall organic molecule
Emp. Form.C19H24N2O5S
Mol. Mass.392.469
SMILESCOc1ccc(cc1)S(=O)(=O)N(Cc1ccccc1)[C@H](C(C)C)C(=O)NO