Reaction Details
TargetMatrix metalloproteinase-9
LigandBDBM8465
Substrate/Competitorn/a
Meas. Tech.ChEMBL_832927 (CHEMBL2066798)
IC50 6±n/a nM
Citation Hugenberg, VBreyholz, HJRiemann, BHermann, SSchober, OSchäfers, MGangadharmath, UMocharla, VKolb, HWalsh, JZhang, WKopka, KWagner, S A new class of highly potent matrix metalloproteinase inhibitors based on triazole-substituted hydroxamates: (radio)synthesis and in vitro and first in vivo evaluation. J Med Chem55:4714-27 (2012) 
 
Matrix metalloproteinase-9
Name:Matrix metalloproteinase-9
Type:Enzyme
Mol. Mass.:78452.28
Organism:Homo sapiens (Human)
Description:P14780
Residue:707
BDBM8465
NameBDBM8465
Synonyms:(2R)-N-hydroxy-2-[(4-methoxybenzene)(pyridin-3-ylmethyl)sulfonamido]-3-methylbutanamide CGS 27023 CHEMBL514138 | hydroxamate analogue 1
TypeSmall organic molecule
Emp. Form.C18H23N3O5S
Mol. Mass.393.457
SMILESCOc1ccc(cc1)S(=O)(=O)N(Cc1cccnc1)[C@H](C(C)C)C(=O)NO