Reaction Details
TargetPeroxisome proliferator-activated receptor gamma
LigandBDBM50085048
Substrate/Competitorn/a
Meas. Tech.ChEMBL_832987 (CHEMBL2067031)
EC50 26±n/a nM
Citation Nevin, DKPeters, MBCarta, GFayne, DLloyd, DG Integrated virtual screening for the identification of novel and selective peroxisome proliferator-activated receptor (PPAR) scaffolds. J Med Chem55:4978-89 (2012) 
 
Peroxisome proliferator-activated receptor gamma
Name:Peroxisome proliferator-activated receptor gamma
Type:Nuclear Receptor
Mol. Mass.:57613.46
Organism:Homo sapiens (Human)
Description:P37231
Residue:505
BDBM50085048
NameBDBM50085048
Synonyms:(S)-2-(2-Benzoyl-phenylamino)-3-{4-[2-(methyl-pyridin-2-yl-amino)-ethoxy]-phenyl}-propionic acid 2-(2-Benzoyl-phenylamino)-3-{4-[2-(methyl-pyridin-2-yl-amino)-ethoxy]-phenyl}-propionic acid | CHEMBL434063
TypeSmall organic molecule
Emp. Form.C30H29N3O4
Mol. Mass.495.569
SMILESCN(CCOc1ccc(C[C@H](Nc2ccccc2C(=O)c2ccccc2)C(O)=O)cc1)c1ccccn1