Reaction Details
TargetPeroxisome proliferator-activated receptor alpha
LigandBDBM50127222
Substrate/Competitorn/a
Meas. Tech.ChEMBL_832991 (CHEMBL2067035)
EC50 920±n/a nM
Citation Nevin, DKPeters, MBCarta, GFayne, DLloyd, DG Integrated virtual screening for the identification of novel and selective peroxisome proliferator-activated receptor (PPAR) scaffolds. J Med Chem55:4978-89 (2012) 
 
Peroxisome proliferator-activated receptor alpha
Name:Peroxisome proliferator-activated receptor alpha
Type:Enzyme
Mol. Mass.:52222.08
Organism:Homo sapiens (Human)
Description:Q07869
Residue:468
BDBM50127222
NameBDBM50127222
Synonyms:CHEMBL38508 {4-[2-(3-Fluoro-4-trifluoromethyl-phenyl)-4-methyl-thiazol-5-ylmethylsulfanyl]-2-methyl-phenoxy}-acetic acid
TypeSmall organic molecule
Emp. Form.C21H17F4NO3S2
Mol. Mass.471.488
SMILESCc1nc(sc1CSc1ccc(OCC(O)=O)c(C)c1)-c1ccc(c(F)c1)C(F)(F)F