Reaction Details
TargetPhosphatidylinositol 4,5-bisphosphate 3-kinase catalytic subunit alpha isoform
LigandBDBM50389281
Substrate/Competitorn/a
Meas. Tech.ChEMBL_831690 (CHEMBL2065053)
Ki 514±n/a nM
Citation Liu, KKBailey, SDinh, DMLam, HLi, CWells, PAYin, MJZou, A Conformationally-restricted cyclic sulfones as potent and selective mTOR kinase inhibitors. Bioorg Med Chem Lett22:5114-7 (2012) 
 
Phosphatidylinositol 4,5-bisphosphate 3-kinase catalytic subunit alpha isoform
Name:Phosphatidylinositol 4,5-bisphosphate 3-kinase catalytic subunit alpha isoform
Type:Enzyme Subunit
Mol. Mass.:124294.87
Organism:Homo sapiens (Human)
Description:P42336
Residue:1068
BDBM50389281
NameBDBM50389281
Synonyms:CHEMBL2063751
TypeSmall organic molecule
Emp. Form.C19H23N5O4S
Mol. Mass.417.482
SMILESCCNC(=O)Nc1ccc(cc1)-c1nc2CS(=O)(=O)Cc2c(n1)N1CCOCC1