Reaction Details
TargetPhosphatidylinositol 4,5-bisphosphate 3-kinase catalytic subunit alpha isoform
LigandBDBM50389288
Substrate/Competitorn/a
Meas. Tech.ChEMBL_831690 (CHEMBL2065053)
Ki 1270±n/a nM
Citation Liu, KKBailey, SDinh, DMLam, HLi, CWells, PAYin, MJZou, A Conformationally-restricted cyclic sulfones as potent and selective mTOR kinase inhibitors. Bioorg Med Chem Lett22:5114-7 (2012) 
 
Phosphatidylinositol 4,5-bisphosphate 3-kinase catalytic subunit alpha isoform
Name:Phosphatidylinositol 4,5-bisphosphate 3-kinase catalytic subunit alpha isoform
Type:Enzyme Subunit
Mol. Mass.:124294.87
Organism:Homo sapiens (Human)
Description:P42336
Residue:1068
BDBM50389288
NameBDBM50389288
Synonyms:CHEMBL2063753
TypeSmall organic molecule
Emp. Form.C20H25N5O4S
Mol. Mass.431.509
SMILESCCNC(=O)Nc1ccc(cc1)-c1nc2CS(=O)(=O)Cc2c(n1)N1CCOC[C@@H]1C