Reaction Details
TargetKetohexokinase
LigandBDBM50380246
Substrate/Competitorn/a
Meas. Tech.ChEMBL_831738 (CHEMBL2065101)
IC50 12±n/a nM
Citation Maryanoff, BEO'Neill, JCMcComsey, DFYabut, SCLuci, DKGibbs, ACConnelly, MA Pyrimidinopyrimidine inhibitors of ketohexokinase: exploring the ring C2 group that interacts with Asp-27B in the ligand binding pocket. Bioorg Med Chem Lett22:5326-9 (2012) 
 
Ketohexokinase
Name:Ketohexokinase
Type:Enzyme Catalytic Domain
Mol. Mass.:32521.64
Organism:Homo sapiens (Human)
Description:n/a
Residue:298
BDBM50380246
NameBDBM50380246
Synonyms:CHEMBL2017214
TypeSmall organic molecule
Emp. Form.C21H26N8S
Mol. Mass.422.55
SMILESCSc1ccccc1Nc1nc(nc2c(NCC3CC3)ncnc12)N1CCNCC1