Reaction Details
TargetSerine/threonine-protein kinase Nek2
LigandBDBM50389320
Substrate/Competitorn/a
Meas. Tech.ChEMBL_831790 (CHEMBL2065153)
IC50<10000±n/a nM
Citation Maryanoff, BEO'Neill, JCMcComsey, DFYabut, SCLuci, DKGibbs, ACConnelly, MA Pyrimidinopyrimidine inhibitors of ketohexokinase: exploring the ring C2 group that interacts with Asp-27B in the ligand binding pocket. Bioorg Med Chem Lett22:5326-9 (2012) 
 
Serine/threonine-protein kinase Nek2
Name:Serine/threonine-protein kinase Nek2
Type:Enzyme
Mol. Mass.:51776.96
Organism:Homo sapiens (Human)
Description:P51955
Residue:445
BDBM50389320
NameBDBM50389320
Synonyms:CHEMBL2063926
TypeSmall organic molecule
Emp. Form.C26H35N9S
Mol. Mass.505.681
SMILESCSc1ccccc1Nc1nc(nc2c(NCC3CC3)ncnc12)N1CCN(CC1)C1CCNCC1