Reaction Details
TargetKetohexokinase
LigandBDBM50389307
Substrate/Competitorn/a
Meas. Tech.ChEMBL_831738 (CHEMBL2065101)
IC50 50±n/a nM
Citation Maryanoff, BEO'Neill, JCMcComsey, DFYabut, SCLuci, DKGibbs, ACConnelly, MA Pyrimidinopyrimidine inhibitors of ketohexokinase: exploring the ring C2 group that interacts with Asp-27B in the ligand binding pocket. Bioorg Med Chem Lett22:5326-9 (2012) 
 
Ketohexokinase
Name:Ketohexokinase
Type:Enzyme Catalytic Domain
Mol. Mass.:32521.64
Organism:Homo sapiens (Human)
Description:n/a
Residue:298
BDBM50389307
NameBDBM50389307
Synonyms:CHEMBL2063928
TypeSmall organic molecule
Emp. Form.C27H36N8S
Mol. Mass.504.693
SMILESCSc1ccccc1Nc1nc(nc2c(NCC3CC3)ncnc12)N1CCC(CC1)C1CCNCC1