Reaction Details
TargetKetohexokinase
LigandBDBM50389322
Substrate/Competitorn/a
Meas. Tech.ChEMBL_831738 (CHEMBL2065101)
IC50 30±n/a nM
Citation Maryanoff, BEO'Neill, JCMcComsey, DFYabut, SCLuci, DKGibbs, ACConnelly, MA Pyrimidinopyrimidine inhibitors of ketohexokinase: exploring the ring C2 group that interacts with Asp-27B in the ligand binding pocket. Bioorg Med Chem Lett22:5326-9 (2012) 
 
Ketohexokinase
Name:Ketohexokinase
Type:Enzyme Catalytic Domain
Mol. Mass.:32521.64
Organism:Homo sapiens (Human)
Description:n/a
Residue:298
BDBM50389322
NameBDBM50389322
Synonyms:CHEMBL2063929
TypeSmall organic molecule
Emp. Form.C27H37N9S
Mol. Mass.519.708
SMILESCSc1ccccc1Nc1nc(nc2c(NCC3CC3)ncnc12)N1CCC(CC1)N1CCN(C)CC1