Reaction Details
TargetKetohexokinase
LigandBDBM50389323
Substrate/Competitorn/a
Meas. Tech.ChEMBL_831738 (CHEMBL2065101)
IC50 15±n/a nM
Citation Maryanoff, BEO'Neill, JCMcComsey, DFYabut, SCLuci, DKGibbs, ACConnelly, MA Pyrimidinopyrimidine inhibitors of ketohexokinase: exploring the ring C2 group that interacts with Asp-27B in the ligand binding pocket. Bioorg Med Chem Lett22:5326-9 (2012) 
 
Ketohexokinase
Name:Ketohexokinase
Type:Enzyme Catalytic Domain
Mol. Mass.:32521.64
Organism:Homo sapiens (Human)
Description:n/a
Residue:298
BDBM50389323
NameBDBM50389323
Synonyms:CHEMBL2063925
TypeSmall organic molecule
Emp. Form.C26H34N8S
Mol. Mass.490.667
SMILESCSc1ccccc1Nc1nc(nc2c(NCC3CC3)ncnc12)N1CCC2(CCNCC2)CC1