Reaction Details
TargetVesicular acetylcholine transporter
LigandBDBM50029051
Substrate/Competitorn/a
Meas. Tech.ChEMBL_832039 (CHEMBL2065481)
Ki>10000±n/a nM
Citation Kozaka, TUno, IKitamura, YMiwa, DOgawa, KShiba, K Syntheses and in vitro evaluation of decalinvesamicol analogues as potential imaging probes for vesicular acetylcholine transporter (VAChT). Bioorg Med Chem20:4936-41 (2012) 
 
Vesicular acetylcholine transporter
Name:Vesicular acetylcholine transporter
Type:PROTEIN
Mol. Mass.:56533.41
Organism:Rattus norvegicus
Description:ChEMBL_1503353
Residue:530
BDBM50029051
NameBDBM50029051
Synonyms:(-)-arterenol (-)-norepinephrine (R)-4-(2-amino-1-hydroxyethyl)-1,2-benzenediol (R)-norepinephrine CHEMBL1437 | NOREPINEPHRINE
TypeSmall organic molecule
Emp. Form.C8H11NO3
Mol. Mass.169.1778
SMILESNC[C@H](O)c1ccc(O)c(O)c1