Reaction Details
TargetOrphan methyltransferase M.SssI
LigandBDBM50389483
Substrate/Competitorn/a
Meas. Tech.ChEMBL_832310 (CHEMBL2066848)
Ki 3400000±n/a nM
Citation Plitta, BAdamska, EGiel-Pietraszuk, MFedoruk-Wyszomirska, ANaskret-Barciszewska, MMarkiewicz, WTBarciszewski, J New cytosine derivatives as inhibitors of DNA methylation. Eur J Med Chem55:243-54 (2012) 
 
Orphan methyltransferase M.SssI
Name:Orphan methyltransferase M.SssI
Type:Protein
Mol. Mass.:44323.75
Organism:Spiroplasma monobiae strain MQ-1
Description:P15840
Residue:386
BDBM50389483
NameBDBM50389483
Synonyms:CHEMBL2063063
TypeSmall organic molecule
Emp. Form.C7H9N3O
Mol. Mass.151.1659
SMILESCCC=Nc1ccnc(=O)[nH]1