Reaction Details
TargetOrphan methyltransferase M.SssI
LigandBDBM50389486
Substrate/Competitorn/a
Meas. Tech.ChEMBL_832310 (CHEMBL2066848)
Ki 5600000±n/a nM
Citation Plitta, BAdamska, EGiel-Pietraszuk, MFedoruk-Wyszomirska, ANaskret-Barciszewska, MMarkiewicz, WTBarciszewski, J New cytosine derivatives as inhibitors of DNA methylation. Eur J Med Chem55:243-54 (2012) 
 
Orphan methyltransferase M.SssI
Name:Orphan methyltransferase M.SssI
Type:Protein
Mol. Mass.:44323.75
Organism:Spiroplasma monobiae strain MQ-1
Description:P15840
Residue:386
BDBM50389486
NameBDBM50389486
Synonyms:CHEMBL2063062
TypeSmall organic molecule
Emp. Form.C6H7N3O
Mol. Mass.137.1393
SMILESCC=Nc1ccnc(=O)[nH]1