Reaction Details
TargetOrphan methyltransferase M.SssI
LigandBDBM50389490
Substrate/Competitorn/a
Meas. Tech.ChEMBL_832312 (CHEMBL2066850)
Ki 35000±n/a nM
Citation Plitta, BAdamska, EGiel-Pietraszuk, MFedoruk-Wyszomirska, ANaskret-Barciszewska, MMarkiewicz, WTBarciszewski, J New cytosine derivatives as inhibitors of DNA methylation. Eur J Med Chem55:243-54 (2012) 
 
Orphan methyltransferase M.SssI
Name:Orphan methyltransferase M.SssI
Type:Protein
Mol. Mass.:44323.75
Organism:Spiroplasma monobiae strain MQ-1
Description:P15840
Residue:386
BDBM50389490
NameBDBM50389490
Synonyms:CHEMBL2063058
TypeSmall organic molecule
Emp. Form.C12H11N3O2
Mol. Mass.229.2346
SMILESO=Cc1cnc(=O)[nH]c1NCc1ccccc1