Reaction Details
TargetOrphan methyltransferase M.SssI
LigandBDBM50389494
Substrate/Competitorn/a
Meas. Tech.ChEMBL_832312 (CHEMBL2066850)
Ki 26000±n/a nM
Citation Plitta, BAdamska, EGiel-Pietraszuk, MFedoruk-Wyszomirska, ANaskret-Barciszewska, MMarkiewicz, WTBarciszewski, J New cytosine derivatives as inhibitors of DNA methylation. Eur J Med Chem55:243-54 (2012) 
 
Orphan methyltransferase M.SssI
Name:Orphan methyltransferase M.SssI
Type:Protein
Mol. Mass.:44323.75
Organism:Spiroplasma monobiae strain MQ-1
Description:P15840
Residue:386
BDBM50389494
NameBDBM50389494
Synonyms:CHEMBL2063053
TypeSmall organic molecule
Emp. Form.C12H13N3O
Mol. Mass.215.2511
SMILESCc1ccc(CNc2ccnc(=O)[nH]2)cc1