Reaction Details
TargetProto-oncogene tyrosine-protein kinase Src
LigandBDBM50389687
Substrate/Competitorn/a
Meas. Tech.ChEMBL_834203 (CHEMBL2072943)
IC50 200±n/a nM
Citation Johnson, SMMurphy, RCGeiger, JADeRocher, AEZhang, ZOjo, KKLarson, ETPerera, BGDale, EJHe, PReid, MCFox, AMMueller, NRMerritt, EAFan, EParsons, MVan Voorhis, WCMaly, DJ Development of Toxoplasma gondii calcium-dependent protein kinase 1 (TgCDPK1) inhibitors with potent anti-toxoplasma activity. J Med Chem55:2416-26 (2012) 
 
Proto-oncogene tyrosine-protein kinase Src
Name:Proto-oncogene tyrosine-protein kinase Src
Type:Protein
Mol. Mass.:59838.60
Organism:Homo sapiens (Human)
Description:P12931
Residue:536
BDBM50389687
NameBDBM50389687
Synonyms:CHEMBL2070054 US11247972, Compound 41 | US9765037, Compound 41
TypeSmall organic molecule
Emp. Form.C21H21N5O
Mol. Mass.359.4243
SMILESCC(C)n1nc(-c2ccc3cc(OCC=C)ccc3c2)c2c(N)ncnc12