Reaction Details
TargetEphrin type-A receptor 3
LigandBDBM50383380
Substrate/Competitorn/a
Meas. Tech.ChEMBL_834207 (CHEMBL2072947)
IC50>10000±n/a nM
Citation Johnson, SMMurphy, RCGeiger, JADeRocher, AEZhang, ZOjo, KKLarson, ETPerera, BGDale, EJHe, PReid, MCFox, AMMueller, NRMerritt, EAFan, EParsons, MVan Voorhis, WCMaly, DJ Development of Toxoplasma gondii calcium-dependent protein kinase 1 (TgCDPK1) inhibitors with potent anti-toxoplasma activity. J Med Chem55:2416-26 (2012) 
 
Ephrin type-A receptor 3
Name:Ephrin type-A receptor 3
Type:Protein
Mol. Mass.:110131.95
Organism:Homo sapiens (Human)
Description:P29320
Residue:983
BDBM50383380
NameBDBM50383380
Synonyms:CHEMBL2030553 US10544104, Compound 28 US9765037, Compound 28
TypeSmall organic molecule
Emp. Form.C22H24N6O
Mol. Mass.388.4656
SMILESCOc1ccc2cc(ccc2c1)-c1nn(CC2CCNCC2)c2ncnc(N)c12