Reaction Details
TargetMelanocortin receptor 4
LigandBDBM50389782
Substrate/Competitorn/a
Meas. Tech.ChEMBL_834300 (CHEMBL2073120)
Ki 0.580000±n/a nM
Citation Conde-Frieboes, KThøgersen, HLau, JFSensfuss, UHansen, TKChristensen, LSpetzler, JOlsen, HBNilsson, CRaun, KDahl, KHansen, BSWulff, BS Identification and in vivo and in vitro characterization of long acting and melanocortin 4 receptor (MC4-R) selectivea-melanocyte-stimulating hormone (a-MSH) analogues. J Med Chem55:1969-77 (2012) 
 
Melanocortin receptor 4
Name:Melanocortin receptor 4
Type:Enzyme
Mol. Mass.:36949.50
Organism:Homo sapiens (Human)
Description:P32245
Residue:332
BDBM50389782
NameBDBM50389782
Synonyms:CHEMBL2070374
TypeSmall organic molecule
Emp. Form.C96H146N28O25
Mol. Mass.2092.359
SMILESCCCC[C@H](NC(=O)[C@H](CNC(=O)CN(CC(O)=O)CC(O)=O)NC(=O)[C@H](Cc1cnc[nH]1)NC(=O)[C@H](CCC(N)=O)NC(=O)[C@H](CO)NC(=O)CNC(=O)COCCOCCNC(=O)CCCCCCCCCCCCCCCc1nnn[nH]1)C(=O)N[C@H]1CCC(=O)NCCCC[C@H](NC(=O)[C@H](Cc2c[nH]c3ccccc23)NC(=O)[C@H](CCCN=C(N)N)NC(=O)[C@@H](Cc2ccccc2)NC(=O)[C@@H]2C[C@@H](O)CN2C1=O)C(N)=O