Reaction Details
TargetSerine/threonine-protein kinase Chk1
LigandBDBM50389803
Substrate/Competitorn/a
Meas. Tech.ChEMBL_834716 (CHEMBL2072692)
IC50 5±n/a nM
Citation Oza, VAshwell, SAlmeida, LBrassil, PBreed, JDeng, CGero, TGrondine, MHorn, CIoannidis, SLiu, DLyne, PNewcombe, NPass, MRead, JReady, SRowsell, SSu, MToader, DVasbinder, MYu, DYu, YXue, YZabludoff, SJanetka, J Discovery of checkpoint kinase inhibitor (S)-5-(3-fluorophenyl)-N-(piperidin-3-yl)-3-ureidothiophene-2-carboxamide (AZD7762) by structure-based design and optimization of thiophenecarboxamide ureas. J Med Chem55:5130-42 (2012) 
 
Serine/threonine-protein kinase Chk1
Name:Serine/threonine-protein kinase Chk1
Type:Enzyme Catalytic Domain
Mol. Mass.:54443.02
Organism:Homo sapiens (Human)
Description:gi_166295192
Residue:476
BDBM50389803
NameBDBM50389803
Synonyms:AZD7762 | CHEMBL2041933
TypeSmall organic molecule
Emp. Form.C17H19FN4O2S
Mol. Mass.362.422
SMILESNC(=O)Nc1cc(sc1C(=O)N[C@H]1CCCNC1)-c1cccc(F)c1