Reaction Details
TargetP2Y purinoceptor 1
LigandBDBM50390014
Substrate/Competitorn/a
Meas. Tech.ChEMBL_833983 (CHEMBL2072723)
Ki 10000±n/a nM
Citation Costanzi, SSanthosh Kumar, TBalasubramanian, RKendall Harden, TJacobson, KA Virtual screening leads to the discovery of novel non-nucleotide P2Y1 receptor antagonists. Bioorg Med Chem20:5254-61 (2012) 
 
P2Y purinoceptor 1
Name:P2Y purinoceptor 1
Type:Enzyme
Mol. Mass.:42090.25
Organism:Homo sapiens (Human)
Description:P47900
Residue:373
BDBM50390014
NameBDBM50390014
Synonyms:CHEMBL2071530
TypeSmall organic molecule
Emp. Form.C18H16F3N5O3S2
Mol. Mass.471.477
SMILESCCc1nnc(NS(=O)(=O)c2ccc(NC(=O)Nc3ccc(cc3)C(F)(F)F)cc2)s1