Reaction Details
TargetP2Y purinoceptor 1
LigandBDBM50390015
Substrate/Competitorn/a
Meas. Tech.ChEMBL_833983 (CHEMBL2072723)
Ki 27000±n/a nM
Citation Costanzi, SSanthosh Kumar, TBalasubramanian, RKendall Harden, TJacobson, KA Virtual screening leads to the discovery of novel non-nucleotide P2Y1 receptor antagonists. Bioorg Med Chem20:5254-61 (2012) 
 
P2Y purinoceptor 1
Name:P2Y purinoceptor 1
Type:Enzyme
Mol. Mass.:42090.25
Organism:Homo sapiens (Human)
Description:P47900
Residue:373
BDBM50390015
NameBDBM50390015
Synonyms:CHEMBL2071532
TypeSmall organic molecule
Emp. Form.C18H16Cl2N4O4S
Mol. Mass.455.315
SMILESCc1noc(NS(=O)(=O)c2ccc(NC(=O)Nc3cc(Cl)cc(Cl)c3)cc2)c1C