Reaction Details
TargetP2Y purinoceptor 1
LigandBDBM59704
Substrate/Competitorn/a
Meas. Tech.ChEMBL_833986 (CHEMBL2072726)
IC50 140±n/a nM
Citation Costanzi, SSanthosh Kumar, TBalasubramanian, RKendall Harden, TJacobson, KA Virtual screening leads to the discovery of novel non-nucleotide P2Y1 receptor antagonists. Bioorg Med Chem20:5254-61 (2012) 
 
P2Y purinoceptor 1
Name:P2Y purinoceptor 1
Type:Enzyme
Mol. Mass.:42090.25
Organism:Homo sapiens (Human)
Description:P47900
Residue:373
BDBM59704
NameBDBM59704
Synonyms:1-(3,4-dichlorophenyl)-3-[4-[(3,4-dimethyl-1,2-oxazol-5-yl)sulfamoyl]phenyl]urea 1-(3,4-dichlorophenyl)-3-[4-[(3,4-dimethylisoxazol-5-yl)sulfamoyl]phenyl]urea MLS000050956 cid_1188014
TypeSmall organic molecule
Emp. Form.C18H16Cl2N4O4S
Mol. Mass.455.315
SMILESCc1noc(NS(=O)(=O)c2ccc(NC(=O)Nc3ccc(Cl)c(Cl)c3)cc2)c1C