Reaction Details
TargetSodium channel protein type 9 subunit alpha
LigandBDBM50390085
Substrate/Competitorn/a
Meas. Tech.ChEMBL_834010 (CHEMBL2072750)
IC50 1258.93±n/a nM
Citation Kers, ICsjernyik, GMacsari, INylöf, MSandberg, LSkogholm, KBueters, TEriksson, ABOerther, SLund, PEVenyike, ENyström, JEBesidski, Y Structure and activity relationship in the (S)-N-chroman-3-ylcarboxamide series of voltage-gated sodium channel blockers. Bioorg Med Chem Lett22:5618-24 (2012) 
 
Sodium channel protein type 9 subunit alpha
Name:Sodium channel protein type 9 subunit alpha
Type:Protein
Mol. Mass.:226375.97
Organism:Homo sapiens (Human)
Description:Q15858
Residue:1988
BDBM50390085
NameBDBM50390085
Synonyms:CHEMBL2069416
TypeSmall organic molecule
Emp. Form.C24H21N5O2
Mol. Mass.411.4558
SMILESCc1nn(nc1C(=O)N[C@@H]1COc2cccc(-c3ccncc3)c2C1)-c1ccccc1