Reaction Details
TargetSodium channel protein type 9 subunit alpha
LigandBDBM50390086
Substrate/Competitorn/a
Meas. Tech.ChEMBL_834010 (CHEMBL2072750)
IC50 25118.86±n/a nM
Citation Kers, ICsjernyik, GMacsari, INylöf, MSandberg, LSkogholm, KBueters, TEriksson, ABOerther, SLund, PEVenyike, ENyström, JEBesidski, Y Structure and activity relationship in the (S)-N-chroman-3-ylcarboxamide series of voltage-gated sodium channel blockers. Bioorg Med Chem Lett22:5618-24 (2012) 
 
Sodium channel protein type 9 subunit alpha
Name:Sodium channel protein type 9 subunit alpha
Type:Protein
Mol. Mass.:226375.97
Organism:Homo sapiens (Human)
Description:Q15858
Residue:1988
BDBM50390086
NameBDBM50390086
Synonyms:CHEMBL2069417
TypeSmall organic molecule
Emp. Form.C21H23N5O3
Mol. Mass.393.439
SMILESCOCCn1nc(C)c(n1)C(=O)N[C@@H]1COc2cccc(-c3ccncc3)c2C1