Reaction Details
TargetSodium channel protein type 5 subunit alpha
LigandBDBM50390073
Substrate/Competitorn/a
Meas. Tech.ChEMBL_834011 (CHEMBL2072751)
IC50 1995.26±n/a nM
Citation Kers, ICsjernyik, GMacsari, INylöf, MSandberg, LSkogholm, KBueters, TEriksson, ABOerther, SLund, PEVenyike, ENyström, JEBesidski, Y Structure and activity relationship in the (S)-N-chroman-3-ylcarboxamide series of voltage-gated sodium channel blockers. Bioorg Med Chem Lett22:5618-24 (2012) 
 
Sodium channel protein type 5 subunit alpha
Name:Sodium channel protein type 5 subunit alpha
Type:Enzyme
Mol. Mass.:226908.60
Organism:Homo sapiens (Human)
Description:Q14524
Residue:2016
BDBM50390073
NameBDBM50390073
Synonyms:CHEMBL2069400
TypeSmall organic molecule
Emp. Form.C22H24F3N3O3
Mol. Mass.435.4395
SMILESCN1CCN(CC1)c1cccc2OC[C@H](Cc12)NC(=O)c1ccc(OC(F)(F)F)cc1