Reaction Details
TargetPotassium voltage-gated channel subfamily H member 2
LigandBDBM50390096
Substrate/Competitorn/a
Meas. Tech.ChEMBL_834012 (CHEMBL2072752)
IC50 25118.86±n/a nM
Citation Kers, ICsjernyik, GMacsari, INylöf, MSandberg, LSkogholm, KBueters, TEriksson, ABOerther, SLund, PEVenyike, ENyström, JEBesidski, Y Structure and activity relationship in the (S)-N-chroman-3-ylcarboxamide series of voltage-gated sodium channel blockers. Bioorg Med Chem Lett22:5618-24 (2012) 
 
Potassium voltage-gated channel subfamily H member 2
Name:Potassium voltage-gated channel subfamily H member 2
Type:Multi-pass membrane protein
Mol. Mass.:126672.65
Organism:Homo sapiens (Human)
Description:Q12809
Residue:1159
BDBM50390096
NameBDBM50390096
Synonyms:CHEMBL2069408
TypeSmall organic molecule
Emp. Form.C22H18F3N3O3
Mol. Mass.429.3918
SMILESFC(F)(F)COc1ccc(cn1)C(=O)N[C@@H]1COc2cccc(-c3cccnc3)c2C1