Reaction Details
TargetSodium channel protein type 5 subunit alpha
LigandBDBM50390079
Substrate/Competitorn/a
Meas. Tech.ChEMBL_834011 (CHEMBL2072751)
IC50 3162.28±n/a nM
Citation Kers, ICsjernyik, GMacsari, INylöf, MSandberg, LSkogholm, KBueters, TEriksson, ABOerther, SLund, PEVenyike, ENyström, JEBesidski, Y Structure and activity relationship in the (S)-N-chroman-3-ylcarboxamide series of voltage-gated sodium channel blockers. Bioorg Med Chem Lett22:5618-24 (2012) 
 
Sodium channel protein type 5 subunit alpha
Name:Sodium channel protein type 5 subunit alpha
Type:Enzyme
Mol. Mass.:226908.60
Organism:Homo sapiens (Human)
Description:Q14524
Residue:2016
BDBM50390079
NameBDBM50390079
Synonyms:CHEMBL2069406
TypeSmall organic molecule
Emp. Form.C22H17F3N2O3
Mol. Mass.414.3772
SMILESFC(F)(F)Oc1ccc(cc1)C(=O)N[C@@H]1COc2cccc(c2C1)-c1cccnc1