Reaction Details
TargetSodium channel protein type 9 subunit alpha
LigandBDBM50390100
Substrate/Competitorn/a
Meas. Tech.ChEMBL_834010 (CHEMBL2072750)
IC50 63.1±n/a nM
Citation Kers, ICsjernyik, GMacsari, INylöf, MSandberg, LSkogholm, KBueters, TEriksson, ABOerther, SLund, PEVenyike, ENyström, JEBesidski, Y Structure and activity relationship in the (S)-N-chroman-3-ylcarboxamide series of voltage-gated sodium channel blockers. Bioorg Med Chem Lett22:5618-24 (2012) 
 
Sodium channel protein type 9 subunit alpha
Name:Sodium channel protein type 9 subunit alpha
Type:Protein
Mol. Mass.:226375.97
Organism:Homo sapiens (Human)
Description:Q15858
Residue:1988
BDBM50390100
NameBDBM50390100
Synonyms:CHEMBL2069420
TypeSmall organic molecule
Emp. Form.C22H19F3N4O3
Mol. Mass.444.4065
SMILESFC(F)(F)CCOc1ccc(cn1)C(=O)N[C@@H]1COc2cccc(-c3cncnc3)c2C1