Reaction Details
TargetSodium channel protein type 5 subunit alpha
LigandBDBM50390084
Substrate/Competitorn/a
Meas. Tech.ChEMBL_834011 (CHEMBL2072751)
IC50 10000±n/a nM
Citation Kers, ICsjernyik, GMacsari, INylöf, MSandberg, LSkogholm, KBueters, TEriksson, ABOerther, SLund, PEVenyike, ENyström, JEBesidski, Y Structure and activity relationship in the (S)-N-chroman-3-ylcarboxamide series of voltage-gated sodium channel blockers. Bioorg Med Chem Lett22:5618-24 (2012) 
 
Sodium channel protein type 5 subunit alpha
Name:Sodium channel protein type 5 subunit alpha
Type:Enzyme
Mol. Mass.:226908.60
Organism:Homo sapiens (Human)
Description:Q14524
Residue:2016
BDBM50390084
NameBDBM50390084
Synonyms:CHEMBL2069414
TypeSmall organic molecule
Emp. Form.C26H26F3N3O5
Mol. Mass.517.4969
SMILESCC(O)c1ccc(cn1)-c1cccc2OC[C@H](Cc12)NC(=O)c1ccc(OCCOCC(F)(F)F)nc1