Reaction Details
TargetCarbonic anhydrase 12
LigandBDBM50390684
Substrate/Competitorn/a
Meas. Tech.ChEMBL_835657 (CHEMBL2071768)
Ki 480±n/a nM
Citation Sechi, MInnocenti, APala, NRogolino, DCarcelli, MScozzafava, ASupuran, CT Inhibition ofa-class cytosolic human carbonic anhydrases I, II, IX and XII, andß-class fungal enzymes by carboxylic acids and their derivatives: new isoform-I selective nanomolar inhibitors. Bioorg Med Chem Lett22:5801-6 (2012) 
 
Carbonic anhydrase 12
Name:Carbonic anhydrase 12
Type:Enzyme
Mol. Mass.:39456.00
Organism:Homo sapiens (Human)
Description:Catalytic domain of human cloned isozyme was used in the assay
Residue:354
BDBM50390684
NameBDBM50390684
Synonyms:CHEMBL2070210
TypeSmall organic molecule
Emp. Form.C10H7NO4
Mol. Mass.205.1669
SMILESOC(=O)C(=O)C1C(=O)Nc2ccccc12