Reaction Details
TargetCarbonic anhydrase 1
LigandBDBM23399
Substrate/Competitorn/a
Meas. Tech.ChEMBL_835654 (CHEMBL2071765)
Ki 5070±n/a nM
Citation Sechi, MInnocenti, APala, NRogolino, DCarcelli, MScozzafava, ASupuran, CT Inhibition ofa-class cytosolic human carbonic anhydrases I, II, IX and XII, andß-class fungal enzymes by carboxylic acids and their derivatives: new isoform-I selective nanomolar inhibitors. Bioorg Med Chem Lett22:5801-6 (2012) 
 
Carbonic anhydrase 1
Name:Carbonic anhydrase 1
Type:Enzyme
Mol. Mass.:28873.37
Organism:Homo sapiens (Human)
Description:P00915
Residue:261
BDBM23399
NameBDBM23399
Synonyms:4-{1-[(4-fluorophenyl)methyl]-1H-pyrrol-2-yl}-2,4-dioxobutanoic acid CHEMBL50605 | L-731988
TypeSmall organic molecule
Emp. Form.C15H12FNO4
Mol. Mass.289.2585
SMILESOC(=O)C(=O)CC(=O)c1cccn1Cc1ccc(F)cc1