Reaction Details
TargetCarbonic anhydrase 1
LigandBDBM50390682
Substrate/Competitorn/a
Meas. Tech.ChEMBL_835654 (CHEMBL2071765)
Ki 6200±n/a nM
Citation Sechi, MInnocenti, APala, NRogolino, DCarcelli, MScozzafava, ASupuran, CT Inhibition ofa-class cytosolic human carbonic anhydrases I, II, IX and XII, andß-class fungal enzymes by carboxylic acids and their derivatives: new isoform-I selective nanomolar inhibitors. Bioorg Med Chem Lett22:5801-6 (2012) 
 
Carbonic anhydrase 1
Name:Carbonic anhydrase 1
Type:Enzyme
Mol. Mass.:28873.37
Organism:Homo sapiens (Human)
Description:P00915
Residue:261
BDBM50390682
NameBDBM50390682
Synonyms:CHEMBL2070208
TypeSmall organic molecule
Emp. Form.C19H15N3O2
Mol. Mass.317.3413
SMILESOC(=O)c1cc(n[nH]1)-c1cn(Cc2ccccc2)c2ccccc12