Reaction Details
TargetCarbonic anhydrase 2
LigandBDBM50184624
Substrate/Competitorn/a
Meas. Tech.ChEMBL_835655 (CHEMBL2071766)
Ki 4350±n/a nM
Citation Sechi, MInnocenti, APala, NRogolino, DCarcelli, MScozzafava, ASupuran, CT Inhibition ofa-class cytosolic human carbonic anhydrases I, II, IX and XII, andß-class fungal enzymes by carboxylic acids and their derivatives: new isoform-I selective nanomolar inhibitors. Bioorg Med Chem Lett22:5801-6 (2012) 
 
Carbonic anhydrase 2
Name:Carbonic anhydrase 2
Type:Enzyme
Mol. Mass.:29250.71
Organism:Homo sapiens (Human)
Description:P00918
Residue:260
BDBM50184624
NameBDBM50184624
Synonyms:6-(2-methoxyphenyl)-2,4,6-trioxohexanoic acid CHEMBL208806
TypeSmall organic molecule
Emp. Form.C13H12O6
Mol. Mass.264.2308
SMILESCOc1ccccc1C(=O)CC(=O)CC(=O)C(O)=O