Reaction Details
TargetCarbonic anhydrase 2
LigandBDBM50390681
Substrate/Competitorn/a
Meas. Tech.ChEMBL_835655 (CHEMBL2071766)
Ki 1820000±n/a nM
Citation Sechi, MInnocenti, APala, NRogolino, DCarcelli, MScozzafava, ASupuran, CT Inhibition ofa-class cytosolic human carbonic anhydrases I, II, IX and XII, andß-class fungal enzymes by carboxylic acids and their derivatives: new isoform-I selective nanomolar inhibitors. Bioorg Med Chem Lett22:5801-6 (2012) 
 
Carbonic anhydrase 2
Name:Carbonic anhydrase 2
Type:Enzyme
Mol. Mass.:29250.71
Organism:Homo sapiens (Human)
Description:P00918
Residue:260
BDBM50390681
NameBDBM50390681
Synonyms:CHEMBL2070207
TypeSmall organic molecule
Emp. Form.C14H13N3O2
Mol. Mass.255.2719
SMILESCCn1cc(-c2cc([nH]n2)C(O)=O)c2ccccc12