Reaction Details
TargetCarbonic anhydrase 9
LigandBDBM50190612
Substrate/Competitorn/a
Meas. Tech.ChEMBL_835656 (CHEMBL2071767)
Ki 6860±n/a nM
Citation Sechi, MInnocenti, APala, NRogolino, DCarcelli, MScozzafava, ASupuran, CT Inhibition ofa-class cytosolic human carbonic anhydrases I, II, IX and XII, andß-class fungal enzymes by carboxylic acids and their derivatives: new isoform-I selective nanomolar inhibitors. Bioorg Med Chem Lett22:5801-6 (2012) 
 
Carbonic anhydrase 9
Name:Carbonic anhydrase 9
Type:Enzyme
Mol. Mass.:49669.03
Organism:Homo sapiens (Human)
Description:Catalytic domain of human cloned isozyme was used in the assay
Residue:459
BDBM50190612
NameBDBM50190612
Synonyms:(2Z)-4-[1-(4-fluoro-benzyl)-1H-pyrrol-2-yl]-2-hydroxy-4-oxo-but-2-enoic acid methyl ester CHEMBL208722
TypeSmall organic molecule
Emp. Form.C16H14FNO4
Mol. Mass.303.2851
SMILESCOC(=O)C(=O)CC(=O)c1cccn1Cc1ccc(F)cc1