Reaction Details
TargetCarbonic anhydrase 9
LigandBDBM50154408
Substrate/Competitorn/a
Meas. Tech.ChEMBL_835656 (CHEMBL2071767)
Ki 8280±n/a nM
Citation Sechi, MInnocenti, APala, NRogolino, DCarcelli, MScozzafava, ASupuran, CT Inhibition ofa-class cytosolic human carbonic anhydrases I, II, IX and XII, andß-class fungal enzymes by carboxylic acids and their derivatives: new isoform-I selective nanomolar inhibitors. Bioorg Med Chem Lett22:5801-6 (2012) 
 
Carbonic anhydrase 9
Name:Carbonic anhydrase 9
Type:Enzyme
Mol. Mass.:49669.03
Organism:Homo sapiens (Human)
Description:Catalytic domain of human cloned isozyme was used in the assay
Residue:459
BDBM50154408
NameBDBM50154408
Synonyms:(Z)-4-(1-Benzyl-1H-indol-3-yl)-2-hydroxy-4-oxo-but-2-enoic acid CHEMBL186820
TypeSmall organic molecule
Emp. Form.C19H15NO4
Mol. Mass.321.3267
SMILESOC(=O)C(=O)CC(=O)c1cn(Cc2ccccc2)c2ccccc12