Reaction Details
TargetCarbonic anhydrase 9
LigandBDBM50390682
Substrate/Competitorn/a
Meas. Tech.ChEMBL_835656 (CHEMBL2071767)
Ki 6120±n/a nM
Citation Sechi, MInnocenti, APala, NRogolino, DCarcelli, MScozzafava, ASupuran, CT Inhibition ofa-class cytosolic human carbonic anhydrases I, II, IX and XII, andß-class fungal enzymes by carboxylic acids and their derivatives: new isoform-I selective nanomolar inhibitors. Bioorg Med Chem Lett22:5801-6 (2012) 
 
Carbonic anhydrase 9
Name:Carbonic anhydrase 9
Type:Enzyme
Mol. Mass.:49669.03
Organism:Homo sapiens (Human)
Description:Catalytic domain of human cloned isozyme was used in the assay
Residue:459
BDBM50390682
NameBDBM50390682
Synonyms:CHEMBL2070208
TypeSmall organic molecule
Emp. Form.C19H15N3O2
Mol. Mass.317.3413
SMILESOC(=O)c1cc(n[nH]1)-c1cn(Cc2ccccc2)c2ccccc12